{"text_format":"1","workbook":"xlsx","n_sheets":14,"sheets":["Introduzione","Controlli di compilazione","Contatti","Sez. A - Clientela","Sez. B - Canali distributivi","Sez. C - Presenza all'estero","Sez. D - Mandati fiduciari","Sez. E - Presidi","Sez. F - Informazioni di gruppo","Istruzioni","Convalida cross-field","Paesi","Paesi UE","Country selections"],"not_rendered":{"charts":0,"images":0,"macros":1,"external_links":0,"defined_names":1,"comments":0,"pivot_tables":0},"unopened":[],"bounds":{"document_bytes":16777216,"sheet_cells":100000,"rows_first":2000,"rows_last":500,"rows_between":2000,"halvings":0,"cell_chars":16384,"cell_head_chars":4096},"cells_cut":0,"cells_raw":0,"read":"whole","date_system":"1900"}

{"sheet":"Introduzione","index":0,"n_rows":9,"n_cols":1,"rows_kept":9,"cut":false,"hidden":false,"merged":[[8,0,8,1],[0,0,0,1],[1,0,1,1],[2,0,2,1],[3,0,3,1],[4,0,4,1],[7,0,7,1],[5,0,5,1],[6,0,6,1]]}
["QUESTIONARIO PER LA RACCOLTA DATI A FINI AML/CFT "]
["INFORMAZIONI GENERALI"]
["La struttura del questionario per la raccolta dati a fini AML/CFT si articola nei seguenti schemi:\n— SEZIONE A: informazioni sulla clientela\n— SEZIONE B: informazioni sui canali distributivi\n— SEZIONE C: informazioni sulla presenza all’estero\n— SEZIONE D: mandati fiduciari\n— SEZIONE E: informazioni sui presidi AML/CFT\n— SEZIONE F: informazioni di gruppo\n\nInoltre, nel foglio \"Contatti\" vanno indicate da una a tre persone da contattare per eventuali chiarimenti o rettifiche.\n\nLa rilevazione si effettua con periodicità annuale con riferimento al 31 dicembre (cd. “data di riferimento”); per “periodo di riferimento” si intende l’arco temporale intercorrente dal 1° gennaio al 31 dicembre. Ai fini della presente rilevazione, la data di riferimento è il 31 dicembre 2021. \nLe sezioni A-B-C ed E devono essere compilate da tutti i soggetti destinatari su base individuale. La sezione D andrà compilata dalle società fiduciarie iscritte nell’albo previsto ai sensi dell’art. 106 del TUB; in caso di gruppi, la sezione F dovrà essere compilata dalle sole capogruppo. \nPer chiarimenti su specifiche domande, si fa rinvio alle istruzioni contenute nell'ultimo foglio del questionario.\n\n\n"]
["AMBITO DI APPLICAZIONE SOGGETTIVO"]
["La rilevazione è rivolta a un campione di intermediari rappresentativo delle principali categorie di soggetti vigilati dalla Banca d'Italia a fini AML/CFT (banche; società di intermediazione mobiliare; società di gestione del risparmio; società di investimento a capitale variabile; società di investimento a capitale fisso, mobiliare e immobiliare; intermediari iscritti nell'albo previsto dall’art. 106 del TUB; istituti di moneta elettronica; istituti di pagamento; succursali insediate in Italia di intermediari bancari e finanziari aventi sede legale e amministrazione centrale in un altro paese UE o in un paese terzo; società fiduciarie iscritte nell’albo previsto dall’art. 106 del TUB; banche, istituti di pagamento e istituti di moneta elettronica aventi sede legale e amministrazione centrale in un altro paese UE tenuti a designare un punto di contatto centrale in Italia ai sensi dell’art. 43, comma 3, del D.lgs. 231/2007; soggetti eroganti micro-credito ai sensi dell’art. 111 del TUB).\n\n\n"]
["ISTRUZIONI PER LA COMPILAZIONE"]
["Facendo rinvio alle Istruzioni Infostat per le indicazioni di carattere tecnico, si precisa quanto segue:\n\nCOMPILAZIONE DA PARTE DEI GRUPPI: \ni) deve essere compilato un questionario individuale per la capogruppo e un questionario individuale per ciascuna componente del gruppo selezionata ai fini dell’indagine; \nii) la sola capogruppo, in sede di compilazione del proprio questionario individuale, è tenuta a rispondere alle domande di cui alla sezione F;\niii) la capogruppo non è tenuta al consolidamento dei dati;\niv) il caricamento dei questionari individuali riferibili alle componenti del gruppo deve essere effettuato dalla capogruppo, che rimane responsabile della correttezza e attendibilità dei dati trasmessi.\n\nSi precisa altresì che la rilevazione si rivolge alle sole componenti di gruppo soggette alla vigilanza AML/CFT della Banca d'Italia. Pertanto, rimangono fuori dal perimetro della rilevazione:\ni) le eventuali controllate con sede all'estero. Al riguardo, l'unica domanda relativa alle componenti con sede all'estero è la numero 43 della sezione F, a cura della capogruppo;\nii) la casa madre di succursali insediate in Italia.\nAi fini della presente rilevazione, la definizione di \"gruppo\" non si estende ai sistemi di tutela istituzionale (Raiffeisen IPS).\n\nDATI DI STOCK E DI FLUSSO: \nsi precisa che i dati quantitativi richiesti nelle sezioni A, C, D e F rappresentano grandezze di stock alla data di riferimento (31.12.2021), mentre i dati quantitativi richiesti nella sezione B rappresentano dati di flusso del periodo di riferimento (dal 1.1.2021 al 31.12.2021). La sezione E include richieste di dati di stock (es. domande 32 e 33) e di flusso (es. domande 34 e 35).\n\nVALORI: \nsi precisa che i valori richiesti nelle sezioni D e E vanno indicati in'unità di Euro, senza decimali. Eventuali valori denominati in altre valute vanno convertiti in Euro utilizzando i cambi di riferimento alla data del 31.12.2021 reperibili sul sito della Banca d'Italia (www.bancaditalia.it/compiti/operazioni-cambi/cambi)\n\nCONTROLLI SULLE CELLE IN SEDE DI COMPILAZIONE:\ni) il questionario richiede l'inserimento di valori numerici oppure la selezione di un'opzione all'interno di un menù a tendina. Non è possibile lasciare celle vuote: pertanto, laddove la domanda non sia applicabile all'intermediario segnalante, andrà comunque indicato il valore \"0\" (laddove siano richiesti numeri) oppure andrà valorizzata una delle opzioni disponibili (nell'ambito dei menù a tendina). Le celle che recano la dicitura \"non richiesto\" non devono essere compilate;\nii) per le domande n. 1.1.1, 1.1.4, 2.1.1, 2.1.3, 4 e 43 occorre procedere alla selezione dei paesi terzi o UE tramite gli appositi box. Per la corretta compilazione di questi campi è necessario abilitare le macro al momento dell'apertura del questionario;\niii) le celle 1, 1.1, 2, 2.1, 3, 3.2, 3.3, 5, 6, 6.1, 6.2, 7, 7.1, 7.2, 9, 18, 23 e 37 sono bloccate, in quanto le somme si calcoleranno in automatico sulla base dei valori inseriti nelle singole sottovoci.\niv) il foglio \"Controlli di compilazione\" offre una sintesi dello stato di compilazione del questionario, evidenziando il numero di celle da compilare ed eventuali messaggi di errore per dati non coerenti (es. parti più numerose del totale). E' necessario assicurarsi che secondo questo foglio tutte le celle risultino compilate e che non siano riportati errori, prima di restituire il questionario compilato.\n\n\n\n\n"]
["DEFINIZIONI"]
{"$rows_left_out":2}
{"sheet":"Controlli di compilazione","index":1,"n_rows":8,"n_cols":3,"rows_kept":8,"cut":false,"hidden":false,"merged":[]}
["Sezione","Da compilare","Messaggi di errore"]
["Contatti",{"$f":"IF(OR(Contatti!A2=\"\",Contatti!B2=\"\",Contatti!C2=\"\"),\"Almeno un contatto da inserire\",\"OK\")","v":"Almeno un contatto da inserire"}]
["Sez. A - Clientela",{"$f":"IF(COUNTBLANK('Sez. A - Clientela'!C2:I18)>61,COUNTBLANK('Sez. A - Clientela'!C2:I18)-61 & \" celle da compilare\",\"OK\")","v":"38 celle da compilare"},{"$f":"IF(ISNA(VLOOKUP(FALSE,'Convalida cross-field'!B2:C27,2,FALSE)),\"\",VLOOKUP(FALSE,'Convalida cross-field'!B2:C27,2,FALSE))","v":""}]
["Sez. B - Canali distributivi",{"$f":"IF(COUNTBLANK('Sez. B - Canali distributivi'!C2:D15)>0,COUNTBLANK('Sez. B - Canali distributivi'!C2:D15) & \" celle da compilare\",\"OK\")","v":"22 celle da compilare"},{"$f":"IF(ISNA(VLOOKUP(FALSE,'Convalida cross-field'!B28:C29,2,FALSE)),\"\",VLOOKUP(FALSE,'Convalida cross-field'!B28:C29,2,FALSE))","v":""}]
["Sez. C - Presenza all'estero",{"$f":"IF(COUNTBLANK('Sez. C - Presenza all''estero'!C2)>0,COUNTBLANK('Sez. C - Presenza all''estero'!C2) & \" celle da compilare\",\"OK\")","v":"1 celle da compilare"},{"$f":"IF(ISNA(VLOOKUP(FALSE,'Convalida cross-field'!B30:C31,2,FALSE)),\"\",VLOOKUP(FALSE,'Convalida cross-field'!B30:C31,2,FALSE))","v":""}]
["Sez. D - Mandati fiduciari",{"$f":"IF(COUNTBLANK('Sez. D - Mandati fiduciari'!C2:D56)>51,COUNTBLANK('Sez. D - Mandati fiduciari'!C2:D56)-51 & \" celle da compilare\",\"OK\")","v":"49 celle da compilare"},{"$f":"IF(ISNA(VLOOKUP(FALSE,'Convalida cross-field'!B32:C33,2,FALSE)),\"\",VLOOKUP(FALSE,'Convalida cross-field'!B32:C33,2,FALSE))","v":""}]
["Sez. E - Presidi",{"$f":"IF(COUNTBLANK('Sez. E - Presidi'!D2:G57)-COUNTIF('Sez. E - Presidi'!G8:G12,\"No\")>134,COUNTBLANK('Sez. E - Presidi'!D2:G57)-COUNTIF('Sez. E - Presidi'!G8:G12,\"No\")-134 & \" celle da compilare\",\"OK\")","v":"53 celle da compilare"},{"$f":"IF(ISNA(VLOOKUP(FALSE,'Convalida cross-field'!B34:C48,2,FALSE)),\"\",VLOOKUP(FALSE,'Convalida cross-field'!B34:C48,2,FALSE))","v":""}]
["Sez. F - Informazioni di gruppo",{"$f":"IF(COUNTBLANK('Sez. F - Informazioni di gruppo'!C2:E6)>5,COUNTBLANK('Sez. F - Informazioni di gruppo'!C2:E6)-5 & \" celle da compilare\",\"OK\")","v":"6 celle da compilare"},{"$f":"IF(ISNA(VLOOKUP(FALSE,'Convalida cross-field'!B49:C51,2,FALSE)),\"\",VLOOKUP(FALSE,'Convalida cross-field'!B49:C51,2,FALSE))","v":""}]
{"$rows_left_out":1}
{"sheet":"Contatti","index":2,"n_rows":1,"n_cols":3,"rows_kept":1,"cut":false,"hidden":false,"merged":[]}
["Nome","Indirizzo e-mail","Numero di telefono"]

{"sheet":"Sez. A - Clientela","index":3,"n_rows":18,"n_cols":10,"rows_kept":18,"cut":false,"hidden":false,"merged":[[10,8,17,8],[2,8,9,8],[10,7,17,7],[11,4,17,4],[0,0,0,1],[10,6,17,6],[2,7,9,7],[2,5,9,5],[11,5,17,5],[2,4,9,4]]}
["Voci",null,"a. Numero di clienti ","a.1 di cui persone fisiche","b. Numero di clienti residenti/con sede all'estero ","b.1 di cui residenti/con sede in paesi terzi","c. Numero di rapporti ","d. Numero di clienti titolari di rapporti continuativi alla data di riferimento che hanno eseguito una o più operazioni occasionali nel periodo di riferimento ","e. Numero di clienti cui sono state applicate misure di congelamento, oggetto di comunicazione alla UIF nel periodo di riferimento (art. 7 D.lgs. 109/2007)"]
[1,"Clienti titolari di uno o più rapporti continuativi alla data di riferimento",{"$f":"SUM(C3+C9+C10)","v":0},{"$f":"SUM(D3+D9+D10)","v":0},null,null,{"$f":"SUM(G3+G9+G10)","v":0}]
["1.1","Clienti a cui l'intermediario applica misure di adeguata verifica rafforzata ai sensi dell'art. 24 D.lgs. 231/2007",{"$f":"SUM(C4:C8)","v":0},{"$f":"SUM(D4:D8)","v":0},"non richiesto","non richiesto",{"$f":"SUM(G4:G8)","v":0},"non richiesto","non richiesto"]
["1.1.1","di cui clienti titolari di rapporti continuativi che coinvolgono paesi terzi ad alto rischio (art. 24, comma 5, lettera a) e art. 1, comma 2, lettera bb), D.lgs. 231/2007)",null,null,null,null,null,null,null,{"$f":"'Country selections'!J4","v":"Fare doppio click per selezionare i paesi"}]
["1.1.2","di cui clienti titolari di rapporti di corrispondenza transfrontalieri, che comportano l'esecuzione di pagamenti, con un ente creditizio o istituto finanziario corrispondente di un paese terzo (art. 24, comma 5, lettera b), D.lgs. 231/2007)",null,"non richiesto"]
["1.1.3","di cui clienti PEP o con titolare effettivo PEP (art. 24, comma 5, lettera c), D.lgs. 231/2007)"]
["1.1.4","di cui clienti titolari di rapporti continuativi che coinvolgono altri paesi terzi ad alto rischio - autonomamente individuati dall'intermediario - diversi da quelli di cui al punto 1.1.1",null,null,null,null,null,null,null,{"$f":"'Country selections'!J7","v":"Fare doppio click per selezionare i paesi"}]
["1.1.5","di cui altri clienti a cui l'intermediario applica misure di adeguata verifica rafforzata, diversi da quelli di cui ai punti precedenti"]
{"$rows_left_out":11}
{"sheet":"Sez. B - Canali distributivi","index":4,"n_rows":15,"n_cols":4,"rows_kept":15,"cut":false,"hidden":false,"merged":[[0,0,0,1]]}
["Voci",null,"a. Numero di clienti titolari di uno o più rapporti continuativi acquisiti nel periodo di riferimento ","b. Numero di clienti non titolari di rapporti continuativi alla data di riferimento che hanno eseguito nel corso del periodo di riferimento una o più operazioni occasionali soggette agli obblighi di adeguata verifica "]
[3,"Nuovi clienti acquisiti nel periodo di riferimento",{"$f":"SUM(C3,C5,C10)","v":0},{"$f":"SUM(D3,D5,D10)","v":0}]
["3.1","Nuovi clienti identificati in presenza da propri dipendenti"]
["3.1.1","di cui identificati in presenza da soggetti equiparabili ai dipendenti (es., consulenti) o, comunque, da soggetti stabilmente incardinati nell’organizzazione del destinatario (es., società del gruppo con sede in Italia) "]
["3.2","Nuovi clienti identificati a distanza",{"$f":"SUM(C6:C9)","v":0},{"$f":"SUM(D6:D9)","v":0}]
["3.2.1","di cui identificati a distanza tramite identità o firme digitali"]
["3.2.2","di cui identificati a distanza tramite procedure di video-identificazione"]
["3.2.3","di cui identificati a distanza utilizzando meccanismi di riconoscimento biometrico"]
{"$rows_left_out":8}
{"sheet":"Sez. C - Presenza all'estero","index":5,"n_rows":2,"n_cols":4,"rows_kept":2,"cut":false,"hidden":false,"merged":[[0,0,0,1]]}
["Voce",null,"a. Scelta in menu a tendina"]
[4,"Presenza in paesi UE in libera prestazione di servizi",null,{"$f":"'Country selections'!D2","v":"Fare doppio click per selezionare i paesi"}]

{"sheet":"Sez. D - Mandati fiduciari","index":6,"n_rows":56,"n_cols":4,"rows_kept":56,"cut":false,"hidden":false,"merged":[[0,0,0,1],[4,2,55,2]]}
["Voci",null,"a. Numero ","b. Valore"]
[5,"Mandati alla data di riferimento",{"$f":"SUM(C3:C4)","v":0},"non richiesto"]
["5.1","Mandati per amministrazione fiduciaria "]
["5.2","Mandati per servizi diversi ",null,"non richiesto"]
[6,"Mandati per amministrazione fiduciaria di cui al punto 5.1: ripartizione per tipologia di rapporto con la clientela","non richiesto",{"$f":"SUM(D6,D13)","v":0}]
["6.1","Mandati con intestazione",null,{"$f":"SUM(D7:D12)","v":0}]
["6.1.1","di cui mandati societari"]
["6.1.2","di cui mandati di investimento"]
{"$rows_left_out":49}
{"sheet":"Sez. E - Presidi","index":7,"n_rows":57,"n_cols":7,"rows_kept":57,"cut":false,"hidden":false,"merged":[[1,0,5,0],[1,6,5,6],[1,3,5,3],[1,5,5,5],[6,5,19,5],[13,6,20,6],[6,3,12,3],[46,4,47,4],[49,4,55,4],[0,1,0,2],[21,0,34,0],[41,4,45,4],[39,4,40,4],[35,4,38,4],[6,4,20,4],[35,0,38,0],[21,4,30,4],[41,0,45,0],[46,0,55,0],[32,3,34,3],[39,0,40,0],[32,4,34,4],[6,0,20,0],[35,7,36,7],[21,5,30,5],[46,5,55,5],[46,6,55,6],[41,5,45,5],[41,6,45,6],[39,5,40,5],[39,6,40,6],[35,6,38,6],[32,6,34,6],[21,6,30,6]]}
["Area tematica","Voci",null,"a. Numero ","b. Ammontare","c. Percentuale","d. Scelta in menù a tendina"]
["Profili economici",8,"Costi diretti relativi al comparto AML/CFT di competenza del periodo di riferimento","non richiesto",null,"non richiesto","non richiesto"]
[null,9,"Investimenti in materia AML/CFT sostenuti nell'ultimo triennio ",null,{"$f":"SUM(E4:E6)","v":0}]
[null,"9.1","di cui nel periodo di riferimento "]
[null,"9.2","di cui nell'anno antecedente il periodo di riferimento "]
[null,"9.3","di cui nel secondo anno antecedente il periodo di riferimento "]
["Assetti organizzativi in materia AML",10,"Collocazione organizzativa della Funzione Antiriciclaggio","non richiesto","non richiesto","non richiesto"]
[null,11,"La Funzione Antiriciclaggio è esternalizzata?"]
{"$rows_left_out":50}
{"sheet":"Sez. F - Informazioni di gruppo","index":8,"n_rows":6,"n_cols":6,"rows_kept":6,"cut":false,"hidden":false,"merged":[[0,0,0,1],[1,2,2,2],[1,3,2,3],[4,3,5,3],[3,4,5,4]]}
["Voci",null,"a. Numero ","b. Percentuale","c. Scelta in menù a tendina"]
[40,"Modello organizzativo della funzione antiriciclaggio (cfr. Disposizioni in materia di organizzazione AML, Parte Quarta, Sezione II)","non richiesto","non richiesto"]
[41,"Modello organizzativo di delega delle SOS  (cfr. Disposizioni in materia di organizzazione AML, Parte Quarta, Sezione III)"]
[42,"Clienti comuni a più società del gruppo (perimetro Italia) alla data di riferimento",null,null,"non richiesto"]
["42.1","di cui clienti comuni con profilo di rischio non allineato tra le società del gruppo (perimetro Italia)",null,"non richiesto"]
[43,"Presenza nel gruppo di succursali o filiazioni stabilite in paesi terzi con ordinamenti che presentano limiti alla circolazione delle informazioni (cfr. Regolamento UE 758/2019) ",null,null,null,{"$f":"'Country selections'!F6","v":"Fare doppio click per selezionare i paesi"}]

{"sheet":"Istruzioni","index":9,"n_rows":60,"n_cols":3,"rows_kept":60,"cut":false,"hidden":false,"merged":[[56,0,59,0],[19,0,24,0],[42,3,44,3],[1,0,18,0],[33,0,55,0],[26,0,32,0]]}
["Sezione","Voci o attributi","Descrizione"]
["Sez. A - Clientela","1. Clienti titolari di uno o più rapporti continuativi alla data di riferimento\n2. Clienti non titolari di rapporti continuativi alla data di riferimento che hanno eseguito nel corso del periodo di riferimento una o più operazioni occasionali soggette agli obblighi di adeguata verifica","I dati quantitativi richiesti nella sezione A rappresentano grandezze di stock alla data di riferimento (31.12.2021). Pertanto, ai fini delle voci 1 e 2 e delle relative sottovoci, rilevano: i) in caso di clienti titolari di rapporti continuativi, la profilatura del cliente alla data di riferimento; ii) in caso di clienti che hanno eseguito operazioni occasionali nel periodo pur non essendo titolari di rapporti, l'ultima profilatura del cliente nel periodo di riferimento."]
[null,"1.1 Clienti a cui l'intermediario applica misure di adeguata verifica rafforzata ai sensi dell'art. 24 D.lgs. 231/2007","Devono essere considerati tutti i clienti titolari di uno o più rapporti continuativi per cui - alla data di riferimento - la policy aziendale, a prescindere dalle classificazioni di rischio in uso presso l’intermediario, prevede misure rafforzate di adeguata verifica.\nLaddove lo stesso cliente ricada in due o più delle sottovoci 1.1.1-1.1.5, andrà indicato in una sola delle sottovoci secondo i seguenti criteri di priorità: 1) conti di corrispondenza, 2) paesi terzi ad alto rischio; 3) PEP; 4) altri paesi ad alto rischio autonomamente individuati."]
[null,"1.1.1. di cui clienti titolari di rapporti continuativi che coinvolgono paesi terzi ad alto rischio (art. 24, comma 5, lettera a) e art. 1, comma 2, lettera bb), D.lgs. 231/2007)","La sottovoce 1.1.1 si riferisce ai rapporti continuativi che coinvolgono paesi terzi ad alto rischio individuati dalla Commissione Europea nell'esercizio dei poteri di cui agli articoli 9 e 64 della direttiva AML (cfr. regolamento delegato (UE) 2016/1675 contenente la lista dei paesi).  Oltre all'indicazione del numero di clienti appartenenti a tale categoria, andranno altresì elencati nell'apposito box sulla stessa riga i paesi terzi ad alto rischio coinvolti."]
[null,"1.1.4. di cui clienti titolari di rapporti continuativi che coinvolgono altri paesi terzi ad alto rischio - autonomamente individuati dall'intermediario - diversi da quelli di cui al punto 1.1.1\n","La sottovoce 1.1.4 si riferisce ai rapporti continuativi che coinvolgono ulteriori paesi terzi – diversi da quelli individuati dalla Commissione europea di cui alla domanda 1.1.1 – per cui la policy aziendale prevede l'applicazione di misure rafforzate di adeguata verifica. Al riguardo, oltre all'indicazione del numero di clienti appartenenti a tale categoria, andranno altresì elencati nell'apposito box sulla stessa riga gli ulteriori paesi terzi coinvolti - diversi da quelli di cui al punto 1.1.1 - che la policy aziendale qualifica ad alto rischio di ML/FT."]
[null,"1.1.5 di cui altri clienti a cui l'intermediario applica misure rafforzate di adeguata verifica, diversi da quelli di cui ai punti precedenti","Tale sottovoce presenta carattere residuale e include tutti gli altri clienti titolari di uno o più rapporti continuativi per cui, alla data di riferimento, la policy aziendale prevede misure rafforzate di adeguata verifica in ragione di fattori di rischio diversi da quelli indicati ai punti 1.1.1-1.1.4 (a titolo esemplificativo, vi rientrano i clienti che sono qualificati a rischio alto per il tipo di attività economica o in quanto strutture qualificabili come veicoli di interposizione patrimoniale). "]
[null,"1.2 Clienti a cui l'intermediario applica misure di adeguata verifica ordinaria","Devono essere considerati tutti i clienti titolari di uno o più rapporti continuativi per cui - alla data di riferimento - la policy aziendale, a prescindere dalle classificazioni di rischio in uso presso l’intermediario, prevede misure ordinarie di adeguata verifica."]
[null,"1.3 Clienti a cui l'intermediario applica misure di adeguata verifica semplificata ai sensi dell'art. 23  D.lgs. 231/2007","Devono essere considerati tutti i clienti titolari di uno o più rapporti continuativi per cui - alla data di riferimento - la policy aziendale, a prescindere dalle classificazioni di rischio in uso presso l’intermediario, prevede misure semplificate di adeguata verifica."]
{"$rows_left_out":53}
{"sheet":"Convalida cross-field","index":10,"n_rows":51,"n_cols":3,"rows_kept":51,"cut":false,"hidden":true,"merged":[]}
["Foglio","Controllo","Messaggio"]
["Sez. A - Clientela",{"$f":"'Sez. A - Clientela'!C4>='Sez. A - Clientela'!D4","v":true},"Sottovoce 1.1.1: il numero di clienti persone fisiche non può essere maggiore del numero di clienti"]
["Sez. A - Clientela",{"$f":"'Sez. A - Clientela'!C6>='Sez. A - Clientela'!D6","v":true},"Sottovoce 1.1.3: il numero di clienti persone fisiche non può essere maggiore del numero di clienti"]
["Sez. A - Clientela",{"$f":"'Sez. A - Clientela'!C7>='Sez. A - Clientela'!D7","v":true},"Sottovoce 1.1.4: il numero di clienti persone fisiche non può essere maggiore del numero di clienti"]
["Sez. A - Clientela",{"$f":"'Sez. A - Clientela'!C8>='Sez. A - Clientela'!D8","v":true},"Sottovoce 1.1.5: il numero di clienti persone fisiche non può essere maggiore del numero di clienti"]
["Sez. A - Clientela",{"$f":"'Sez. A - Clientela'!C9>='Sez. A - Clientela'!D9","v":true},"Sottovoce 1.2: il numero di clienti persone fisiche non può essere maggiore del numero di clienti"]
["Sez. A - Clientela",{"$f":"'Sez. A - Clientela'!C10>='Sez. A - Clientela'!D10","v":true},"Sottovoce 1.3: il numero di clienti persone fisiche non può essere maggiore del numero di clienti"]
["Sez. A - Clientela",{"$f":"'Sez. A - Clientela'!C13>='Sez. A - Clientela'!D13","v":true},"Sottovoce 2.1.1: il numero di clienti persone fisiche non può essere maggiore del numero di clienti"]
{"$rows_left_out":44}
{"sheet":"Paesi","index":11,"n_rows":249,"n_cols":2,"rows_kept":249,"cut":false,"hidden":true,"merged":[]}
["Codice","Nome"]
["AFG","Afghanistan"]
["ALB","Albania"]
["DZA","Algeria"]
["AND","Andorra"]
["AGO","Angola"]
["AIA","Anguilla"]
["ATA","Antartide"]
{"$rows_left_out":242}
{"sheet":"Paesi UE","index":12,"n_rows":27,"n_cols":2,"rows_kept":27,"cut":false,"hidden":true,"merged":[]}
["Codice","Nome"]
["AUT","Austria"]
["BEL","Belgio"]
["BGR","Bulgaria"]
["CYP","Cipro"]
["HRV","Croazia"]
["DNK","Danimarca"]
["EST","Estonia"]
{"$rows_left_out":20}
{"sheet":"Country selections","index":13,"n_rows":15,"n_cols":10,"rows_kept":15,"cut":false,"hidden":true,"merged":[]}
[]
[null,null,null,"Fare doppio click per selezionare i paesi"]
[]
[null,null,null,null,null,null,null,null,null,"Fare doppio click per selezionare i paesi"]
[]
[null,null,null,null,null,"Fare doppio click per selezionare i paesi"]
[null,null,null,null,null,null,null,null,null,"Fare doppio click per selezionare i paesi"]
[]
{"$rows_left_out":7}